Filtrér

Mine seneste søgninger
Filtrer ved:
Budget
til
til
til
Slags
Evner
Sprog
    Job-status
    6,643 error 0 jobs fundet, i prisklassen EUR

    ...wp_version_check() b. The loopback request to your site failed, this may prevent WP_Cron from working, along with theme and plugin editors. Error encountered: (0) cURL error 28: Operation timed out after 10015 milliseconds with 0 bytes received 10. The logo in the wp-login page should be changeable and the layout/template as well. 11. Looking at the errors

    €181 (Avg Bid)
    €181 Gns Bud
    68 bud

    We need to edit the API url from [log ind for at se URL] to [log ind for at se URL] We do not need any job done only the solution to our problem. Please, do not apply to job if you don't have the answer to it. We pay a fixed rate for immediate help. Thanks

    €72 (Avg Bid)
    €72 Gns Bud
    16 bud

    Need DFD based on provided Use Cases.

    €83 (Avg Bid)
    €83 Gns Bud
    9 bud

    We need to edit the API url from [log ind for at se URL] to [log ind for at se URL] We do not need any job done only the solution to our problem. Please, do not apply to job if you don't have the answer to it. We pay a fixed rate for immediate help. Then we will discuss our

    €358 (Avg Bid)
    €358 Gns Bud
    17 bud

    ...Elementor- It happens that your database is corrupted and this is why Elementor pro is not working properly. The end of this following error show us that the database is corrupted: [01-Nov-2018 14:29:53 UTC] PHP Fatal error: Uncaught TypeError: Argument 1 passed to ElementorControls_Stack::sanitize_settings() must be of the type array, string given, called

    €27 (Avg Bid)
    €27 Gns Bud
    8 bud

    We just moved a site from development to live and now get the following error when trying to download a product: Unable to insert download log entry in database. The WordPress error log shows the following entry: 16-Nov-2018 05:20:54 UTC] WordPress database error Cannot add or update a child row: a foreign key constraint fails (`livesite_wp522`

    €23 (Avg Bid)
    €23 Gns Bud
    9 bud

    ...smoothly. But when I reinstall the OS and reconfigured the software again. It is showing a Blank page. If I change the [log ind for at se URL] 0 to 1 then it is showing the error message ( attached the screenshot). Here I attached the error message and database screenshot. I would like to the Skilled developer to resolve the issue accessing my computer via Team Viewer

    €15 (Avg Bid)
    €15 Gns Bud
    2 bud

    We are an adult entertainment company that needs some assistance with our server. We are running an apache server...apache server for Linux, running Joomla 3.8.10. We would like to upgrade our pHp from 7.0.32 to 7.2.10. When attempting to push the upgrade through the server we get an 'error 0' message on the front end of the site which disables it.

    €62 (Avg Bid)
    €62 Gns Bud
    20 bud

    We are an early education company that develops an app teaching English for kids aged 0-10. We're looking for 3-4 native writers to help us produce children stories (i.e. fairy tales, fables, moral stories, including poems as well, etc.). These will be introduced to our global users, especially the young kids. Therefore, we need skilled writers with

    €142 (Avg Bid)
    €142 Gns Bud
    27 bud

    We have currently a bug in Magento 2 causing an error in Admin and also set the stock on 0 (zero) on one of our sites (multistore) As this is an AJAX related issue we're looking for an expert Site working with stock: [log ind for at se URL] Site with AJAX stock error: [log ind for at se URL] They are running the same database. See images attached. Thank

    €25 (Avg Bid)
    €25 Gns Bud
    6 bud
    Revise PHP webapp Udløbet left

    ...without undergoing a full test (error!) and discovered after loading it into my server that it did not run well in chrome. I am sure there is a code error but this guy has [log ind for at se URL] excuse is that the program works perfectly and it is a problem of my server. So I need an expert in php7 to test this app and correct the error (if there is any), in a very

    PHP
    €176 (Avg Bid)
    €176 Gns Bud
    35 bud

    ...IsDate(ele) Then MsgBox "Incorrect Date" Exit Sub End If dt = Replace(ele, "/", "-") On Error Resume Next Set ws = [log ind for at se URL](dt) If ws Is Nothing Then [log ind for at se URL]().Name = dt Set ws = [log ind for at se URL](dt) End If On Error GoTo 0 [log ind for at se URL] Set ie = New InternetExplorer url = "[log ind for at ...

    €121 (Avg Bid)
    €121 Gns Bud
    8 bud

    ...something here if the subscription does not exist. Throw New ApplicationException([log ind for at se URL]( _ "A subscription to '{0}' does not exists on {1}", _ publicationName, subscriberName)) End If Catch ex As Exception ' Implement appropriate error handling here. Throw New ApplicationException("The subscription could not be synchronized.", e...

    €128 (Avg Bid)
    €128 Gns Bud
    2 bud

    We have a custom joomla component...component in which occurs an php 500 error for one of the functionalities. The php error is a result of switching from php 5.6.x to php 7.2x The 500 error is visible when website is in debug mode. Something like "500 Error: Using $this when not in object context in home/.../.../ [log ind for at se URL] Stack trace: #0&quo...

    €15 / hr (Avg Bid)
    €15 / hr Gns Bud
    19 bud

    ... 2. An interval [a, b]; e.g. [0 1]. 3. The tolerance ɛ. The output should be 1. A figure for the function curve 2. If there is no solution in this interval it should output No solution for this interval. 3. If there is a solution: A table containing all the iterations and the values of { a, b , Xr, f(a), f(xr), error } after each iteration. I would

    €60 (Avg Bid)
    €60 Gns Bud
    17 bud

    I need someone to help debug a Magento site quickly. After installing a paid extension, many buttons have stopped...debug a Magento site quickly. After installing a paid extension, many buttons have stopped working with the javascript:void(0) error and the new extension is barely working. Bid if you can do this. (see screenshot for error messages)

    €15 (Avg Bid)
    €15 Gns Bud
    7 bud

    Another user was given access to my wordpress site to fix 1 error that was occurring on a specific page. This was a small fix and was told it would be easy to get done in under 1 hour. Instead this user created other issues which eventually caused our site to be unresonsive for several hours. Since yesterday we currently have the following issues;

    €133 (Avg Bid)
    €133 Gns Bud
    28 bud

    Another user was given access to my wordpress site to fix 1 error that was occurring on a specific page. This was a small fix and was told it would be easy to get done in under 1 hour. Instead this user created other issues which eventually caused our site to be unresonsive for several hours. Since yesterday we currently have the following issues;

    €11 / hr (Avg Bid)
    Fremhævet
    €11 / hr Gns Bud
    18 bud

    magento expert needed to fix problem and make it work. The problem is when I try to disable or install a module getting error and website crashes, I think something to do with deploy. You will need to connect to my pc via anydesk as no credentials will be provided

    €80 (Avg Bid)
    €80 Gns Bud
    14 bud

    hi recently i got some issues like 1: server going down sometime, client getting 503 error while accessing website 2: client using our api get error like : Operation timed out after 25000 milliseconds with 0 bytes received 3:using top in ssh show mysql to be around 100-150 sometimes need to work using remote on my pc

    €24 (Avg Bid)
    €24 Gns Bud
    9 bud

    We have problem with Cross Origin on real device, we use a contact form with Mailgun and we get this error: {"_body": {“isTrusted”: true}, “status”: 0, “ok”: false, “statusText”: “”, “headers”: {}, “type”: 3, “url”: null} On android platform works fine, but on IOS it’s no...

    €25 (Avg Bid)
    €25 Gns Bud
    3 bud
    bash assignment Udløbet left

    ...command line options or arguments comments describing the script error messages going to stderr correct exit status Add command line arguments to a script The following script fragment will roll virtual dice and show what was rolled and what the total rolled was. sum=0 while [ $count -gt 0 ]; do roll=$(( $RANDOM % $sides +1 )) sum=$(( $sum + $roll

    €122 (Avg Bid)
    €122 Gns Bud
    10 bud

    ...subscription does not exist. Throw New ApplicationException([log ind for at se URL]( _ "A subscription to '{0}' does not exists on {1}", _ publicationName, subscriberName)) End If Catch ex As Exception ' Implement appropriate error handling here. Throw New ApplicationException("The subscription could not be synchr...

    €132 (Avg Bid)
    €132 Gns Bud
    1 bud

    Cpanel was working fine and it stopped showing. I am getting this error: Cpanel::Exception::IO::FileCreateError/(XID aa3kk9) The system failed to create the file “/var/cpanel/sessions/raw/:[log ind for at se URL]” (as [asis,EUID]: 0, [asis,EGID]: 0) because of the following error: No space left on device at /usr/local/cpanel/Cpanel/[log ind for at se URL] ...

    €27 (Avg Bid)
    €27 Gns Bud
    19 bud

    I have a mini project to apply for the food court mobile app;

    €22 (Avg Bid)
    €22 Gns Bud
    1 bud

    ...have installed OsTicket on my server, however I am getting an error when attempting to reply to a ticket via the app directly. Using the email functions, the ticketing system works. This error only happens when attempting to reply to a ticket on the website. This is in the error log [:error] [pid 22981] [client x.x.x.x:13518] PHP Warning: Declaration

    €83 (Avg Bid)
    €83 Gns Bud
    10 bud
    Calculator Udløbet left

    I need a code in C++ for a calculator To do : 1. Arbitrary number of operands 1+1+1+1+1 -> 5 2. Unary operators +1+1 -> 2 3. +-*/ Tak...do : 1. Arbitrary number of operands 1+1+1+1+1 -> 5 2. Unary operators +1+1 -> 2 3. +-*/ Take care of precedence 1+2*3 -> 4. Error checking Divide by 0 erroneous expression eg. 1+2* -> Error

    €23 (Avg Bid)
    €23 Gns Bud
    12 bud

    ...a CR Magnetics CR3110 AC output to 0-5 Volt DC or 0-10 Volt DC. High accuracy is not critical since the signal can be curve fit in the PLC. Miniature components is important so everything can fit on a board .875 X 1.125 inch. Data Sheet attached. I am open to a different sensing element. Need a way to measure 0-75 amps and get the signal into a PLC

    €21 / hr (Avg Bid)
    €21 / hr Gns Bud
    14 bud

    Compositor de música para canción de rock/ balada, desde 0 música y letra, en español

    €147 (Avg Bid)
    €147 Gns Bud
    17 bud

    ...able to run without error. We can reserve the top row if needed and create a button if needed. The script is below and here is a video also which illustrates the issue. [log ind for at se URL] This task must be done within Google Sheets and cannot be stand-alone Excel function onEdit(e) { var id_cell_val = 0; var source_row =

    €29 (Avg Bid)
    €29 Gns Bud
    3 bud

    Necesito un sitio web nuevo. Necesito que diseñen y creen mi tienda en línea. Que tenga las funciones igual que [log ind for at se URL] , por favor ponerme el precio final y que la página sea fácil de modificar para entrar nuevos artículos o modificar precios.

    €526 (Avg Bid)
    €526 Gns Bud
    16 bud

    ...Version from 5 to PHP 7. Therefore our Magento Shop is not working. We get the error message: Fatal error: Uncaught Error: Function name must be a string in /is/htdocs/wp1181886_62B8XEPMZF/www/[log ind for at se URL]:555 Stack trace: #0 /is/htdocs/wp1181886_62B8XEPMZF/www/[log ind for at se URL]

    €126 (Avg Bid)
    €126 Gns Bud
    20 bud

    deliverable: project compiles without error and runs. using: Windows 10 QTCreator 4.7.1 QT SDK 5.11.1 VS 2017 Community edition see this thread: [log ind for at se URL] must fix these errors and warnings: error C2065: 'INTMAX_MAX': undeclared identifier warning C4002: too many arguments for function-like macro invocation

    €48 / hr (Avg Bid)
    €48 / hr Gns Bud
    12 bud

    Error parsing input URL, no data was cached, or no data was scraped. Curl Error : OPERATION_TIMEOUTED Operation timed out after 10000 milliseconds with 0 bytes received

    €17 / hr (Avg Bid)
    €17 / hr Gns Bud
    10 bud

    Hi I need a video like this: [log ind for at se URL] - same subtitle style - same audio transition - remove wind on background - same transition URGENT TASK I NEED DONE IN 1 HOUR MAX... I need 2 format 16:9 and 9:16 here the text for subtitle: Video - 2 Se hai un computer ed una conessione WI-FI questo fa per te! Video - 3 Ciao! Sono Silvia Galati e tutti mi conoscono come TheOnlineGirl...

    €54 (Avg Bid)
    €54 Gns Bud
    6 bud

    ...2.2.6 Error - when trying to creat theme [log ind for at se URL] site went down Error details: [2018-10-24 06:22:06] [log ind for at se URL]: Theme layout update file '/home/....../public_html/app/design/frontend/Infortis/base/Magento_Theme/layout/[log ind for at se URL]' is not valid. {"exception":"[object] (MagentoFrameworkConfigDomValidationE...

    €141 (Avg Bid)
    €141 Gns Bud
    21 bud

    ...cache: false, data: fd , crossDomain: true, success: function(response) { [log ind for at se URL](response); }, error: function(err) { [log ind for at se URL](err); } }); if you get the result like following with file, your code works well. but I can't change the third

    €21 (Avg Bid)
    €21 Gns Bud
    9 bud

    ...library that was custom created, that communicates with a 3rd party and imports the requested information. The component and library are working, except that at times I get an error 0 Invalid controller: name='run', format=''. It's like it was running, then all of a sudden it just timed out. The original developer believes that "I think it's just...

    €133 (Avg Bid)
    €133 Gns Bud
    22 bud

    ...am seeing the following error and I am also not able to change the pages. Attached is the screenshot of the error as well. Fatal error: Uncaught Error: Function name must be a string in /hermes/bosnacweb04/bosnacweb04at/b373/[log ind for at se URL]:85 Stack trace: #0 /hermes/bosnacweb04/bo

    €25 (Avg Bid)
    €25 Gns Bud
    22 bud

    ...periodically when sports get added or dropped from our system Getting the Sport files Getting the Data Some event variables will only appear if they contain values that are not 0. currentpriceup currentpricedown currenthandicap If currentpriceup and currentpricedown are missing then the price is SP. The navigation value will show where the event is displayed

    €508 (Avg Bid)
    €508 Gns Bud
    12 bud

    When I am finishing the order in the checkout, the system told us "Internal Server Error". We put the system in debug mode and it gave me this issue "syntaxerror unexpected token in json at position 0". I have tried everything: plugins off, update Woocommerce template in original one, etc but nothing works. Please help me.

    €25 (Avg Bid)
    €25 Gns Bud
    7 bud

    ...a Unix administrator with experience in installing php v7.2 and Nginx on Debian 8 server (Google Cloud VM). The commands have been attempted below but we are still getting error messages on broken packages. sudo apt update user@server:/$ sudo apt-get install php7.2 php7.2-cli php7.2-opcache php7.2-curl php7.2-zip libapache2-mod-php7.0 php7.2-cli

    €25 (Avg Bid)
    €25 Gns Bud
    6 bud

    ...framerate / auto detect framerate from camera - Can adjust the distance between line A and B - Can adjust the line A and B - If red dot cross line A and B calculate the speed - Error is not more than 3km/h (will be ground test with Lidar) - the software can set the speed limit - If the car hit over speed take as 3 picture and overlay black bar with speed

    €894 (Avg Bid)
    €894 Gns Bud
    22 bud

    ...Maven build Error. May be JDK not installed properly. Error message below: --- maven-compiler-plugin:3.7.0:compile (default-compile) @ demo --- [INFO] Nothing to compile - all classes are up to date [ERROR] Tests run: 1, Failures: 0, Errors: 1, Skipped: 0, Time elapsed: 0.255 s <<< FAILURE! - in [log ind for at se URL] [ERROR] initialization...

    €27 (Avg Bid)
    €27 Gns Bud
    3 bud

    I have installed termux and node red on an android device - Le...termux and node red on an android device - Lenovo tablet-. It worked perfectly, but without any reason, it stopped working and in termux it shows below error "unexpected token p in json at position 0" I need someone to remotely connect to my tablet (e.g. teamviewer) and solve the problem

    €16 (Avg Bid)
    €16 Gns Bud
    4 bud

    ...checkout... I want to have 2 decimals (now there are 3). But I want to keep 3 decimals in my admin area. 2. If you open product detail and category pages, an error appears. Need to fix this error and possible others: Warning: Missing argument 1 for Mage_Catalog_Helper_Image::resize(), called in /web/sites/8178/app/design/frontend/default/theme557/te

    €149 (Avg Bid)
    €149 Gns Bud
    22 bud
    Social media 0 Udløbet left

    Create content for social media + linkedin This includes making the Graphics and content Please send relevant work for both: personal branding and business accounts

    €88 (Avg Bid)
    €88 Gns Bud
    18 bud

    ...check: Canonical link point on page with http status code: 0 Alternate link check: Alternate link point on page with http status code: 0 Alternate link check: Alternate link point on page with http status code: 301 Alternate link check: Alternate link point on page with http status code: 0 Alternate link check: Alternate link point on page with http

    €226 (Avg Bid)
    €226 Gns Bud
    17 bud

    [log ind for at se URL] I want to make something like this I want basically to test this circuit and code and a small pcb design with SMD parts. I prefer with atmega8 or atmega328

    €111 (Avg Bid)
    €111 Gns Bud
    1 bud

    [log ind for at se URL] I want to make something like this I want basically to test this circuit and code and a small pcb design with SMD parts. I prefer atmega8 or atmega328

    €161 (Avg Bid)
    €161 Gns Bud
    6 bud